Target
Type-1 angiotensin II receptor B
Ligand
BDBM50282263
Substrate
Meas. Tech.
ChEMBL_34830 (CHEMBL648764)
IC50
7.6±n/a nM
Citation
 Perreaut, PClément, JMuneaux, CMuneaux, YCazaubon, CGougat, JGuiraudou, PLacour, CNisato, DFur, GLBreliere, JC Dihydro-imidazolone derivatives as angiotensin II receptor antagonists: chiral effect on the activity Bioorg Med Chem Lett 4:163-168 (1994)    Article 
Target
Name:
Type-1 angiotensin II receptor B
Synonyms:
AGTRB_RAT Agtr1 Angiotensin II AT1B Angiotensin II type 1b (AT-1b) receptor Type-1B angiotensin II receptor
Type:
Enzyme Catalytic Domain
Mol. Mass.:
40929.44
Organism:
RAT
Description:
Angiotensin II AT1B 0 RAT::P29089
Residue:
359
  
Inhibitor
Name:
BDBM50282263
Synonyms:
2-Butyl-5-cyclopentyl-5-methyl-3-[2'-(2H-tetrazol-5-yl)-biphenyl-4-ylmethyl]-3,5-dihydro-imidazol-4-one | CHEMBL47985
Type:
Small organic molecule
Emp. Form.:
C27H32N6O
Mol. Mass.:
456.5826
SMILES:
CCCCC1=NC(C)(C2CCCC2)C(=O)N1Cc1ccc(cc1)-c1ccccc1-c1nnn[nH]1
: