Target
5-hydroxytryptamine receptor 4
Ligand
BDBM50056401
Substrate
Meas. Tech.
ChEMBL_3341 (CHEMBL619041)
Ki
5.3±n/a nM
Citation
 Langlois, MZhang, LBre´mont, BShen, SManara, LCroci, T Design of a potent 5-HT4 receptor agonist with nanomolar affinity Bioorg Med Chem Lett 4:1433-1436 (1994)    Article 
Target
Name:
5-hydroxytryptamine receptor 4
Synonyms:
5-HT-4 5-HT4L 5-hydroxytryptamine receptor 4 Htr4 Serotonin 4 (5-HT4) receptor
Type:
Enzyme Catalytic Domain
Mol. Mass.:
46117.31
Organism:
RAT
Description:
5-HT4 HTR4 RAT::Q62758
Residue:
406
  
Inhibitor
Name:
BDBM50056401
Synonyms:
2-diethylaminoethyl [2-methoxy-4-amino-5-chloro]benzoate CHEMBL287045 SDZ-205557
Type:
Small organic molecule
Emp. Form.:
C14H21ClN2O3
Mol. Mass.:
300.781
SMILES:
CCN(CC)CCOC(=O)c1cc(Cl)c(N)cc1OC
: