Target
Type-2 angiotensin II receptor
Ligand
BDBM50283311
Substrate
Meas. Tech.
ChEMBL_35559 (CHEMBL647339)
IC50
1.8±n/a nM
Citation
 Glinka, TWde Laszlo, SESiegl, PKChang, RSKivlighn, SDSchorn, TSFaust, KAChen, TBZingaro, GJLotti, VJGreenlee, WJ Development of angiotensin II antagonists with equipotent affinity for human AT1 and AT2 receptor subtypes. Bioorg Med Chem Lett 4:2337-2342 (1994)    Article 
Target
Name:
Type-2 angiotensin II receptor
Synonyms:
AGTR2_RAT Agtr2 Angiotensin II receptor Type-2 angiotensin II receptor
Type:
Enzyme Catalytic Domain
Mol. Mass.:
41346.62
Organism:
RAT
Description:
Angiotensin II AT2 0 0::P35351
Residue:
363
  
Inhibitor
Name:
BDBM50283311
Synonyms:
2-ethyl-3-(3-fluoro-2'-(3-methyl-butyloxycarbonylaminosulphonyl)-biphenyl-4-ylmethyl)-6-(2-pyridylcarbonylamino)-3H-quinazolin-4-one | CHEMBL74144
Type:
Small organic molecule
Emp. Form.:
C35H34FN5O6S
Mol. Mass.:
671.738
SMILES:
CCc1nc2ccc(NC(=O)c3ccccn3)cc2c(=O)n1Cc1ccc(cc1F)-c1ccccc1S(=O)(=O)NC(=O)OCCC(C)C
: