Target
Chymotrypsinogen B
Ligand
BDBM50284351
Substrate
Meas. Tech.
ChEMBL_34124 (CHEMBL649752)
Ki
>2000000±n/a nM
Citation
 Iyer, RAHanna, PE N-(carbobenzyloxy)isatin: A slow binding α-keto lactam inhibitor of α-chymotrypsin Bioorg Med Chem Lett 5:89-92 (1995)    Article 
Target
Name:
Chymotrypsinogen B
Synonyms:
Beta-chymotrypsin CTRB1 Chymotrypsin B chain A Chymotrypsin B chain C Synonyms=CTRB
Type:
PROTEIN
Mol. Mass.:
27713.98
Organism:
Homo sapiens (Human)
Description:
ChEMBL_10909
Residue:
263
  
Inhibitor
Name:
BDBM50284351
Synonyms:
2,3-Dioxo-2,3-dihydro-indole-1-carboxylic acid tert-butyl ester | CHEMBL173129
Type:
Small organic molecule
Emp. Form.:
C13H13NO4
Mol. Mass.:
247.2466
SMILES:
CC(C)(C)OC(=O)N1C(=O)C(=O)c2ccccc12
: