Target
Caspase-1
Ligand
BDBM50284745
Substrate
Meas. Tech.
ChEBML_90989
Ki
2000±n/a nM
Citation
 Mjalli, AMZhao, JJChapman, KTThornberry, NAPeterson, EPMacCoss, MHagmann, WK Inhibition of interleukin-1β converting enzyme by N-acyl-aspartyl aryloxymethyl ketones Bioorg Med Chem Lett 5:1409-1414 (1995)    Article 
Target
Name:
Caspase-1
Synonyms:
CASP1 Caspase ICE IL1BCE Interleukin-1 beta-converting enzyme
Type:
Enzyme
Mol. Mass.:
45154.13
Organism:
Homo sapiens (Human)
Description:
P29466
Residue:
404
  
Inhibitor
Name:
BDBM50284745
Synonyms:
3-Allyloxycarbonylamino-5-(4-carbamoyl-biphenyl-3-yloxy)-4-oxo-pentanoic acid | CHEMBL31785
Type:
Small organic molecule
Emp. Form.:
C22H22N2O7
Mol. Mass.:
426.4193
SMILES:
NC(=O)c1ccc(cc1OCC(=O)C(CC(O)=O)NC(=O)OCC=C)-c1ccccc1
: