Target
Caspase-1
Ligand
BDBM50284747
Substrate
Meas. Tech.
ChEBML_90989
Ki
9500±n/a nM
Citation
 Mjalli, AMZhao, JJChapman, KTThornberry, NAPeterson, EPMacCoss, MHagmann, WK Inhibition of interleukin-1β converting enzyme by N-acyl-aspartyl aryloxymethyl ketones Bioorg Med Chem Lett 5:1409-1414 (1995)    Article 
Target
Name:
Caspase-1
Synonyms:
CASP1 Caspase ICE IL1BCE Interleukin-1 beta-converting enzyme
Type:
Enzyme
Mol. Mass.:
45154.13
Organism:
Homo sapiens (Human)
Description:
P29466
Residue:
404
  
Inhibitor
Name:
BDBM50284747
Synonyms:
3-Allyloxycarbonylamino-5-(naphthalen-1-yloxy)-4-oxo-pentanoic acid | CHEMBL31042
Type:
Small organic molecule
Emp. Form.:
C19H19NO6
Mol. Mass.:
357.3573
SMILES:
OC(=O)CC(NC(=O)OCC=C)C(=O)COc1cccc2ccccc12
: