Target
Gastrin/cholecystokinin type B receptor
Ligand
BDBM50285007
Substrate
Meas. Tech.
ChEBML_40187
IC50
2.7±n/a nM
Citation
 Lowe, JADrozda, SEMcLean, SBryce, DKCrawford, RTZorn, SMorrone, JAppleton, TALombardo, F A water soluble benzazepine cholecystokinin-B receptor antagonist Bioorg Med Chem Lett 5:1933-1936 (1995)    Article 
Target
Name:
Gastrin/cholecystokinin type B receptor
Synonyms:
CCK-2 receptor CCK-BR CCKRB Cholecystokinin receptor GASR_HUMAN | Gastrin/cholecystokinin type B receptor
Type:
G Protein-Coupled Receptor (GPCR)
Mol. Mass.:
48445.79
Organism:
Homo sapiens (Human)
Description:
Stable expression of human CCK-2 receptors in HEK 293 cells.
Residue:
447
  
Inhibitor
Name:
BDBM50285007
Synonyms:
3-{3-[(3R,5R)-1-(tert-Butylcarbamoyl-methyl)-8-methyl-2-oxo-5-phenyl-2,3,4,5-tetrahydro-1H-benzo[b]azepin-3-yl]-ureido}-benzoic acid | CHEMBL301261
Type:
Small organic molecule
Emp. Form.:
C31H34N4O5
Mol. Mass.:
542.6255
SMILES:
Cc1ccc2[C@H](C[C@@H](NC(=O)Nc3cccc(c3)C(O)=O)C(=O)N(CC(=O)NC(C)(C)C)c2c1)c1ccccc1
: