Target
Adenosine receptor A2a
Ligand
BDBM50285554
Substrate
Meas. Tech.
ChEBML_30902
Ki
101±n/a nM
Citation
 Chebib, MQuinn, RJ Pyrazolo[3,4-d]pyrimidines; adenosine receptor selectivity Bioorg Med Chem Lett 5:2409-2412 (1995)    Article 
Target
Name:
Adenosine receptor A2a
Synonyms:
AA2AR_RAT Adenosine A2 receptor Adenosine Receptors A2a (A2a) Adenosine receptors A2a Rat striatal adenosine A2a receptor
Type:
G Protein-Coupled Receptor (GPCR)
Mol. Mass.:
45015.65
Organism:
Rattus norvegicus (rat)
Description:
Rat A2A receptors expressed in CHO cells.
Residue:
410
  
Inhibitor
Name:
BDBM50285554
Synonyms:
3-(4-Amino-1-phenyl-1H-pyrazolo[3,4-d]pyrimidin-6-ylsulfanyl)-propionamide | CHEMBL79201
Type:
Small organic molecule
Emp. Form.:
C14H14N6OS
Mol. Mass.:
314.366
SMILES:
NC(=O)CCSc1nc(N)c2cnn(-c3ccccc3)c2n1
: