Target
Cysteinyl leukotriene receptor 1
Ligand
BDBM50285682
Substrate
Meas. Tech.
ChEMBL_99994 (CHEMBL710519)
IC50
1.91±n/a nM
Citation
 Labelle, MGareau, YDufresne, CLau, CKBelley, MJones, TRLeblanc, YMcAuliffe, MMcFarlane, CSMetters, KMOuimet, NPerrier, HRochette, CSawyer, NSlipetz, DXiang, YBWang, ZPickett, CBFord-Hutchinson, AWYoung, RN Discovery of L-740,515, a potent thienopyridine cysLT1 receptor (LTD4 receptor) antagonist Bioorg Med Chem Lett 5:2551-2556 (1995)    Article 
Target
Name:
Cysteinyl leukotriene receptor 1
Synonyms:
CLTR1_HUMAN CYSLTR1 Cysteinyl leukotriene receptor HG55 LTD4 receptor | Leukotriene Cysteinyl 1
Type:
Enzyme Catalytic Domain
Mol. Mass.:
38565.16
Organism:
Homo sapiens (Human)
Description:
Leukotriene Cysteinyl 1 CYSLTR1 HUMAN::Q9Y271
Residue:
337
  
Inhibitor
Name:
BDBM50285682
Synonyms:
(1-{(R)-1-{3-[(E)-2-(3-Chloro-thieno[3,2-b]pyridin-5-yl)-vinyl]-phenyl}-3-[2-(1-hydroxy-1-methyl-ethyl)-phenyl]-propylsulfanylmethyl}-cyclopropyl)-acetic acid | CHEMBL84707
Type:
Small organic molecule
Emp. Form.:
C33H34ClNO3S2
Mol. Mass.:
592.211
SMILES:
CC(C)(O)c1ccccc1CC[C@@H](SCC1(CC(O)=O)CC1)c1cccc(\C=C\c2ccc3scc(Cl)c3n2)c1
: