Target
Cholecystokinin receptor type A
Ligand
BDBM50059319
Substrate
Meas. Tech.
ChEBML_50051
IC50
1604±n/a nM
Citation
 Showell, GABourrain, SFletcher, SRNeduvelil, JGFletcher, AEFreedman, SBPatel, SSmith, AJMarshall, GRGraham, MISohal, BMatassa, VG C5-piperazinyl-1,4-benzodiazepines, water-soluble, orally bioa vailable CCKB/gastrin receptor antagonists Bioorg Med Chem Lett 5:3023-3026 (1995)    Article 
Target
Name:
Cholecystokinin receptor type A
Synonyms:
CCKAR_RAT Cholecystokinin peripheral Cholecystokinin receptor type A
Type:
Enzyme Catalytic Domain
Mol. Mass.:
49676.37
Organism:
RAT
Description:
Cholecystokinin central 0 RAT::P30551
Residue:
444
  
Inhibitor
Name:
BDBM50059319
Synonyms:
1-[(R)-5-(3-Aza-bicyclo[3.2.2]non-3-yl)-1-methyl-2-oxo-2,3-dihydro-1H-benzo[e][1,4]diazepin-3-yl]-3-m-tolyl-urea | CHEMBL420783
Type:
Small organic molecule
Emp. Form.:
C26H31N5O2
Mol. Mass.:
445.5566
SMILES:
CN1c2ccccc2C(=N[C@@H](NC(=O)Nc2cccc(C)c2)C1=O)N1CC2CCC(CC2)C1
: