Target
Cholecystokinin receptor type A
Ligand
BDBM50286147
Substrate
Meas. Tech.
ChEBML_49403
IC50
4500±n/a nM
Citation
 Holladay, MWBennett, MJBai, HRalston, JWKerwin, JFStashko, MMiller, TRO'Neill, ABNadzan, AMBrioni, JLin, CW Amino acid-derived piperidides as novel CCKB ligands with anxiolytic-like properties Bioorg Med Chem Lett 5:3057-3062 (1995)    Article 
Target
Name:
Cholecystokinin receptor type A
Synonyms:
CCK-A receptor CCK1-R CCKAR_CAVPO Cholecystokinin receptor type A | Cholecystokinin-1 receptor
Type:
Mol. Mass.:
48229.77
Organism:
Cavia porcellus
Description:
Residue:
430
  
Inhibitor
Name:
BDBM50286147
Synonyms:
CHEMBL319196 | [(S)-2-(4-Benzoyl-piperidin-1-yl)-1-(1H-indol-3-ylmethyl)-2-oxo-ethyl]-carbamic acid tert-butyl ester
Type:
Small organic molecule
Emp. Form.:
C28H33N3O4
Mol. Mass.:
475.5793
SMILES:
CC(C)(C)OC(=O)N[C@@H](Cc1c[nH]c2ccccc12)C(=O)N1CCC(CC1)C(=O)c1ccccc1
: