Target
Protein farnesyltransferase subunit beta/geranylgeranyltransferase type-1 subunit alpha
Ligand
BDBM50287116
Substrate
Meas. Tech.
ChEMBL_70143 (CHEMBL685966)
IC50
13000±n/a nM
Citation
 Lamothe, MPerrin, DBlotières, DLeborgne, MGras, SBonnet, DHill, BTHalazy, S Inhibition of farnesyl protein transferase by new farnesyl phosphonate derivatives of phenylalanine Bioorg Med Chem Lett 6:1291-1296 (1996)    Article 
Target
Name:
Protein farnesyltransferase subunit beta/geranylgeranyltransferase type-1 subunit alpha
Synonyms:
Protein Farnesyltransferase (PFT) | Protein farnesyltransferase
Type:
Protein Complex
Mol. Mass.:
Description:
Purified bovine brain FTase.
Components:
This complex has 2 components.
Component 1
Name:
Protein farnesyltransferase/geranylgeranyltransferase type-1 subunit alpha
Synonyms:
CAAX farnesyltransferase alpha subunit FNTA_BOVIN GGTase-I-alpha Protein Farnesyltransferase (PFT) Chain A Protein farnesyltransferase/geranylgeranyltransferase type I alpha subunit Type I protein geranyl-geranyltransferase alpha subunit
Type:
Enzyme
Mol. Mass.:
43827.38
Organism:
Bos taurus (bovine)
Description:
The enzyme was purified from a bovine brain homogenate by sequential ammonium sulfate fractionation and affinity chromatography.
Residue:
375
  
Component 2
Name:
Protein farnesyltransferase subunit beta
Synonyms:
CAAX farnesyltransferase subunit beta FNTB_BOVIN Protein farnesyltransferase Protein farnesyltransferase subunit beta Ras proteins prenyltransferase subunit beta
Type:
Enzyme Subunit
Mol. Mass.:
48758.49
Organism:
Bos taurus (bovine)
Description:
Protein farnesyltransferase subunit beta
Residue:
437
  
Inhibitor
Name:
BDBM50287116
Synonyms:
((3E,7E)-4,8,12-Trimethyl-1-phenethylcarbamoyl-trideca-3,7,11-trienyl)-phosphonic acid | CHEMBL284240
Type:
Small organic molecule
Emp. Form.:
C25H38NO4P
Mol. Mass.:
447.5473
SMILES:
[#6]-[#6](-[#6]-[#6]\[#6]=[#6](/[#6])-[#6]-[#6]\[#6]=[#6](\[#6])-[#6])-[#6]-[#6]=[#6](-[#6](=O)-[#7]-[#6]-[#6]-c1ccccc1)P([#8])([#8])=O
: