Target
Squalene synthase
Ligand
BDBM50287115
Substrate
Meas. Tech.
ChEBML_202100
IC50
220±n/a nM
Citation
 Lamothe, MPerrin, DBlotières, DLeborgne, MGras, SBonnet, DHill, BTHalazy, S Inhibition of farnesyl protein transferase by new farnesyl phosphonate derivatives of phenylalanine Bioorg Med Chem Lett 6:1291-1296 (1996)    Article 
Target
Name:
Squalene synthase
Synonyms:
FDFT_RAT Farnesyl-diphosphate farnesyltransferase SQS Squalene synthetase
Type:
PROTEIN
Mol. Mass.:
48109.41
Organism:
Rattus norvegicus
Description:
ChEMBL_1336736
Residue:
416
  
Inhibitor
Name:
BDBM50287115
Synonyms:
(S)-3-Phenyl-2-((5E,9E)-6,10,14-trimethyl-3-phosphono-pentadeca-5,9,13-trienoylamino)-propionic acid | CHEMBL418195
Type:
Small organic molecule
Emp. Form.:
C27H40NO6P
Mol. Mass.:
505.5834
SMILES:
[#6]-[#6](-[#6]-[#6]\[#6]=[#6](/[#6])-[#6]-[#6]\[#6]=[#6](/[#6])-[#6])-[#6]-[#6]=[#6](-[#6]-[#6](=O)-[#7]-[#6@@H](-[#6]-c1ccccc1)-[#6](-[#8])=O)P([#8])([#8])=O
: