Target
Neuropeptide Y receptor type 1
Ligand
BDBM50287528
Substrate
Meas. Tech.
ChEBML_144144
Ki
1135±n/a nM
Citation
 Wright, JBolton, GCreswell, MDowning, DGeorgic, LHeffner, THodges, JMacKenzie, RWise, L 8-amino-6-(arylsulphonyl)-5-nitroquinolines: novel nonpeptide neuropeptide Y1 receptor antagonists Bioorg Med Chem Lett 6:1809-1814 (1996)    Article 
Target
Name:
Neuropeptide Y receptor type 1
Synonyms:
NPY-Y1 NPY1R NPYR neuropeptide Y receptor Y1
Type:
Enzyme Catalytic Domain
Mol. Mass.:
44399.07
Organism:
Homo sapiens (Human)
Description:
NPY-Y1 NPY1R HUMAN::P25929
Residue:
384
  
Inhibitor
Name:
BDBM50287528
Synonyms:
6-(4-Methoxy-benzenesulfonyl)-5-nitro-quinolin-8-ylamine | CHEMBL299965
Type:
Small organic molecule
Emp. Form.:
C16H13N3O5S
Mol. Mass.:
359.357
SMILES:
COc1ccc(cc1)S(=O)(=O)c1cc(N)c2ncccc2c1[N+]([O-])=O
: