Target
Dual specificity calcium/calmodulin-dependent 3',5'-cyclic nucleotide phosphodiesterase 1B/Dual specificity calcium/calmodulin-dependent 3',5'-cyclic nucleotide phosphodiesterase 1C/Phosphodiesterase
Ligand
BDBM50287546
Substrate
Meas. Tech.
ChEMBL_156164 (CHEMBL760933)
IC50
3300±n/a nM
Citation
 Terrett, NKBell, ASBrown, DEllis, P Sildenafil (VIAGRATM), a potent and selective inhibitor of type 5 cGMP phosphodiesterase with utility for the treatment of male erectile dysfunction Bioorg Med Chem Lett 6:1819-1824 (1996)    Article 
Target
Name:
Dual specificity calcium/calmodulin-dependent 3',5'-cyclic nucleotide phosphodiesterase 1B/Dual specificity calcium/calmodulin-dependent 3',5'-cyclic nucleotide phosphodiesterase 1C/Phosphodiesterase
Synonyms:
Dual specificity Calcium/calmodulin-dependent 3',5'-cyclic nucleotide phosphodiesterase 1C/Dual specificity calcium/calmodulin-dependent 3',5'-cyclic nucleotide phosphodiesterase 1B/Phosphodiesterase | Phosphodiesterase 1
Type:
Mol. Mass.:
Description:
ASSAY_ID of ChEMBL is 154419
Components:
This complex has 3 components.
Component 1
Name:
Dual specificity calcium/calmodulin-dependent 3',5'-cyclic nucleotide phosphodiesterase 1C
Synonyms:
Calcium/calmodulin-dependent 3',5'-cyclic nucleotide phosphodiesterase 1C Dual specificity Calcium/calmodulin-dependent 3',5'-cyclic nucleotide phosphodiesterase 1C Pde1c | Pde1c2
Type:
PROTEIN
Mol. Mass.:
86691.70
Organism:
Rattus norvegicus
Description:
ChEMBL_105015
Residue:
768
  
Component 2
Name:
Phosphodiesterase
Synonyms:
Pde1a | Phosphodiesterase 1A
Type:
PROTEIN
Mol. Mass.:
61851.57
Organism:
Rattus norvegicus
Description:
ChEMBL_105015
Residue:
542
  
Component 3
Name:
Dual specificity calcium/calmodulin-dependent 3',5'-cyclic nucleotide phosphodiesterase 1B
Synonyms:
63 kDa Cam-PDE PDE1B_RAT Pde1b1 | Phosphodiesterase 1
Type:
PROTEIN
Mol. Mass.:
61248.78
Organism:
Rattus norvegicus
Description:
ChEMBL_105015
Residue:
535
  
Inhibitor
Name:
BDBM50287546
Synonyms:
5-(2-Ethoxy-phenyl)-1,3-dimethyl-1,6-dihydro-pyrazolo[4,3-d]pyrimidin-7-one CHEMBL51814
Type:
Small organic molecule
Emp. Form.:
C15H16N4O2
Mol. Mass.:
284.3131
SMILES:
CCOc1ccccc1-c1nc2c(C)nn(C)c2c(=O)[nH]1
: