Target
cGMP-specific 3',5'-cyclic phosphodiesterase
Ligand
BDBM14390
Substrate
Meas. Tech.
ChEBML_155206
IC50
3.00±n/a nM
Citation
 Terrett, NKBell, ASBrown, DEllis, P Sildenafil (VIAGRATM), a potent and selective inhibitor of type 5 cGMP phosphodiesterase with utility for the treatment of male erectile dysfunction Bioorg Med Chem Lett 6:1819-1824 (1996)    Article 
Target
Name:
cGMP-specific 3',5'-cyclic phosphodiesterase
Synonyms:
3',5'-cyclic phosphodiesterase PDE5 PDE5A_HUMAN Phosphodiesterase 5 (PDE5) Phosphodiesterase 5A (PDE5A) cGMP-specific 3',5'-cyclic phosphodiesterase
Type:
Protein
Mol. Mass.:
99975.83
Organism:
Homo sapiens (Human)
Description:
O76074
Residue:
875
  
Inhibitor
Name:
BDBM14390
Synonyms:
5-[2-ethoxy-5-(4-methyl-1-piperazinylsulfonyl)phenyl]-1-methyl-3-n-propyl-1,6-dihydro-7H-pyrazolo[4,3-d]pyrimidin-7-one CHEMBL192 Sildenafil US11155558, Compound sildenafil Viagra
Type:
Small organic molecule
Emp. Form.:
C22H30N6O4S
Mol. Mass.:
474.576
SMILES:
CCCc1nn(C)c2c1nc([nH]c2=O)-c1cc(ccc1OCC)S(=O)(=O)N1CCN(C)CC1
: