Target
cGMP-specific 3',5'-cyclic phosphodiesterase
Ligand
BDBM50111899
Substrate
Meas. Tech.
ChEMBL_155364 (CHEMBL762509)
IC50
27±n/a nM
Citation
 Terrett, NKBell, ASBrown, DEllis, P Sildenafil (VIAGRATM), a potent and selective inhibitor of type 5 cGMP phosphodiesterase with utility for the treatment of male erectile dysfunction Bioorg Med Chem Lett 6:1819-1824 (1996)    Article 
Target
Name:
cGMP-specific 3',5'-cyclic phosphodiesterase
Synonyms:
3',5'-cyclic phosphodiesterase PDE5 PDE5A_HUMAN Phosphodiesterase 5 (PDE5) Phosphodiesterase 5A (PDE5A) cGMP-specific 3',5'-cyclic phosphodiesterase
Type:
Protein
Mol. Mass.:
99975.83
Organism:
Homo sapiens (Human)
Description:
O76074
Residue:
875
  
Inhibitor
Name:
BDBM50111899
Synonyms:
5-(2-Ethoxy-phenyl)-1-methyl-3-propyl-1,6-dihydro-pyrazolo[4,3-d]pyrimidin-7-one CHEMBL54079
Type:
Small organic molecule
Emp. Form.:
C17H20N4O2
Mol. Mass.:
312.3663
SMILES:
CCCc1nn(C)c2c1nc([nH]c2=O)-c1ccccc1OCC
: