Target
Kappa-type opioid receptor
Ligand
BDBM50247803
Substrate
Meas. Tech.
ChEMBL_220952 (CHEMBL823202)
Ki
67±n/a nM
Citation
 Derrick, IMoynihan, HABroadbear, JWoods, JHLewis, JW 6N-Cinnamoyl-β-naltrexamine and its p-nitro derivative. High efficacy κ-opioid agonists with weak antagonist actions Bioorg Med Chem Lett 6:167-172 (1996)    Article 
Target
Name:
Kappa-type opioid receptor
Synonyms:
Kappa Opioid Receptor OPRK1 Opiate Kappa 1 | mu/kappa opioid receptor
Type:
G Protein-Coupled Receptor (GPCR)
Mol. Mass.:
42744.99
Organism:
Cavia porcellus (domestic guinea pig)
Description:
P41144
Residue:
380
  
Inhibitor
Name:
BDBM50247803
Synonyms:
Beta-Funeltrexamine beta-funaltrexamine methyl 3-[4-cyclopropylmethyl-10,17-dihydroxy-12-oxa-4-azapentacyclo[9.6.1.01,13.05,17.07,18]octadeca-7(18),8,10-trien-14-ylcarbamoyl]-(E)-2-propenoate
Type:
Small organic molecule
Emp. Form.:
C25H30N2O6
Mol. Mass.:
454.5155
SMILES:
COC(=O)\C=C\C(=O)N[C@@H]1CC[C@@]2(O)[C@H]3Cc4ccc(O)c5O[C@@H]1[C@]2(CCN3CC1CC1)c45
: