Target
Carbonic anhydrase 2
Ligand
BDBM50288892
Substrate
Meas. Tech.
ChEMBL_45054 (CHEMBL658052)
Kd
5±n/a nM
Citation
 Sigal, GBWhitesides, GM Benzenesulfonamide-peptide conjugates as probes for secondary binding sites near the active site of carbonic anhydrase Bioorg Med Chem Lett 6:559-564 (1996)    Article 
Target
Name:
Carbonic anhydrase 2
Synonyms:
CA-II CAC Carbonate dehydratase II Carbonic anhydrase 2 (CA-II) Carbonic anhydrase C Carbonic anhydrase II (CA-II) Carbonic anhydrase II (hCA II) | Carbonic anhydrase isoenzyme II (hCA II)
Type:
Enzyme
Mol. Mass.:
29250.71
Organism:
Homo sapiens (Human)
Description:
P00918
Residue:
260
  
Inhibitor
Name:
BDBM50288892
Synonyms:
2-(4-Sulfamoyl-benzoylamino)-hexanoic acid | CHEMBL153748
Type:
Small organic molecule
Emp. Form.:
C13H18N2O5S
Mol. Mass.:
314.357
SMILES:
CCCCC(NC(=O)c1ccc(cc1)S(N)(=O)=O)C(O)=O
: