Target
Carbonic anhydrase 2
Ligand
BDBM50288857
Substrate
Meas. Tech.
ChEBML_45054
Kd
100±n/a nM
Citation
 Sigal, GBWhitesides, GM Benzenesulfonamide-peptide conjugates as probes for secondary binding sites near the active site of carbonic anhydrase Bioorg Med Chem Lett 6:559-564 (1996)    Article 
Target
Name:
Carbonic anhydrase 2
Synonyms:
CA-II CAC Carbonate dehydratase II Carbonic anhydrase 2 (CA-II) Carbonic anhydrase C Carbonic anhydrase II (CA-II) Carbonic anhydrase II (hCA II) | Carbonic anhydrase isoenzyme II (hCA II)
Type:
Enzyme
Mol. Mass.:
29250.71
Organism:
Homo sapiens (Human)
Description:
P00918
Residue:
260
  
Inhibitor
Name:
BDBM50288857
Synonyms:
3-(4-Chloro-phenyl)-2-[2-(4-sulfamoyl-benzoylamino)-acetylamino]-propionic acid | CHEMBL357304
Type:
Small organic molecule
Emp. Form.:
C18H18ClN3O6S
Mol. Mass.:
439.87
SMILES:
NS(=O)(=O)c1ccc(cc1)C(=O)NCC(=O)NC(Cc1ccc(Cl)cc1)C(O)=O
: