Target
Carbonic anhydrase 2
Ligand
BDBM50288863
Substrate
Meas. Tech.
ChEBML_45054
Kd
330±n/a nM
Citation
 Sigal, GBWhitesides, GM Benzenesulfonamide-peptide conjugates as probes for secondary binding sites near the active site of carbonic anhydrase Bioorg Med Chem Lett 6:559-564 (1996)    Article 
Target
Name:
Carbonic anhydrase 2
Synonyms:
CA-II CAC Carbonate dehydratase II Carbonic anhydrase 2 (CA-II) Carbonic anhydrase C Carbonic anhydrase II (CA-II) Carbonic anhydrase II (hCA II) | Carbonic anhydrase isoenzyme II (hCA II)
Type:
Enzyme
Mol. Mass.:
29250.71
Organism:
Homo sapiens (Human)
Description:
P00918
Residue:
260
  
Inhibitor
Name:
BDBM50288863
Synonyms:
3-Hydroxy-2-{2-[2-(4-sulfamoyl-benzoylamino)-acetylamino]-acetylamino}-butyric acid | CHEMBL2371109
Type:
Small organic molecule
Emp. Form.:
C17H23N5O9S
Mol. Mass.:
473.458
SMILES:
C[C@@H](O)[C@H](NC(=O)CNC(=O)CNC(=O)CNC(=O)c1ccc(cc1)S(N)(=O)=O)C(O)=O
: