Target
Carbonic anhydrase 2
Ligand
BDBM50288875
Substrate
Meas. Tech.
ChEBML_45054
Kd
17±n/a nM
Citation
 Sigal, GBWhitesides, GM Benzenesulfonamide-peptide conjugates as probes for secondary binding sites near the active site of carbonic anhydrase Bioorg Med Chem Lett 6:559-564 (1996)    Article 
Target
Name:
Carbonic anhydrase 2
Synonyms:
CA-II CAC Carbonate dehydratase II Carbonic anhydrase 2 (CA-II) Carbonic anhydrase C Carbonic anhydrase II (CA-II) Carbonic anhydrase II (hCA II) | Carbonic anhydrase isoenzyme II (hCA II)
Type:
Enzyme
Mol. Mass.:
29250.71
Organism:
Homo sapiens (Human)
Description:
P00918
Residue:
260
  
Inhibitor
Name:
BDBM50288875
Synonyms:
3-Naphthalen-2-yl-2-(4-sulfamoyl-benzoylamino)-propionic acid | CHEMBL152487
Type:
Small organic molecule
Emp. Form.:
C20H18N2O5S
Mol. Mass.:
398.432
SMILES:
NS(=O)(=O)c1ccc(cc1)C(=O)NC(Cc1ccc2ccccc2c1)C(O)=O
: