Target
cGMP-specific 3',5'-cyclic phosphodiesterase
Ligand
BDBM50289464
Substrate
Meas. Tech.
ChEBML_213258
IC50
190±n/a nM
Citation
 Doller, DChackalamannil, SStamford, AMcKittrick, BCzarniecki, M The Gif system as a tool in medicinal chemistry: The oxidation of Sch 57726 under GoAggIII conditions Bioorg Med Chem Lett 7:1381-1386 (1997)    Article 
Target
Name:
cGMP-specific 3',5'-cyclic phosphodiesterase
Synonyms:
PDE5 PDE5A_BOVIN | Phosphodiesterase 5A
Type:
PROTEIN
Mol. Mass.:
98615.45
Organism:
Bos taurus
Description:
ChEMBL_155186
Residue:
865
  
Inhibitor
Name:
BDBM50289464
Synonyms:
3'-benzyl-2'-(4-cyclohexylphenyl)-5'-methylspiro[cyclopentane-1,7'-(4',5',7',8'-tetrahydro-3'H-imidazo[2,1-b]purine)]-4'-one SCH-57726
Type:
Small organic molecule
Emp. Form.:
C31H35N5O
Mol. Mass.:
493.6425
SMILES:
CN1C2=NC3(CCCC3)CN2c2nc(-c3ccc(cc3)C3CCCCC3)n(Cc3ccccc3)c2C1=O
: