Target
Endothelin receptor type B
Ligand
BDBM50289651
Substrate
Meas. Tech.
ChEBML_63513
IC50
1000±n/a nM
Citation
 Suzawa, TShibata, KTanaka, TMatsuda, YYamasaki, M RES-701-1/endothelin-1 hybrid peptide having a potent binding activity for type B receptor Bioorg Med Chem Lett 7:1715-1720 (1997)    Article 
Target
Name:
Endothelin receptor type B
Synonyms:
EDNRB Endothelin receptor ET-B
Type:
PROTEIN
Mol. Mass.:
49389.50
Organism:
Bos taurus
Description:
ChEMBL_63513
Residue:
441
  
Inhibitor
Name:
BDBM50289651
Synonyms:
CHEMBL407188 | Compound [S15]ET-1
Type:
Small organic molecule
Emp. Form.:
C65H89N13O15
Mol. Mass.:
1292.4803
SMILES:
CC[C@H](C)[C@H](NC(=O)[C@@H](NC(=O)[C@H](CC(O)=O)NC(=O)[C@H](CC(C)C)NC(=O)[C@H](Cc1cnc[nH]1)NC(=O)[C@H](CO)NC(=O)[C@H](Cc1ccccc1)NC(=O)[C@H](Cc1ccc(O)cc1)NC(=O)[C@@H](N)C(C)C)[C@@H](C)CC)C(=O)N[C@@H](Cc1c[nH]c2ccccc12)C(O)=O
: