Target
Endothelin receptor type B
Ligand
BDBM50289942
Substrate
Meas. Tech.
ChEBML_63682
IC50
>100000±n/a nM
Citation
 Raju, BWu, CCastillo, ROkun, IStavros, FChan, MF 2-Aryloxycarbonylthiophene-3-sulfonamides: Highly potent and etA selective endothelin receptor antagonists Bioorg Med Chem Lett 7:2093-2098 (1997)    Article 
Target
Name:
Endothelin receptor type B
Synonyms:
EDNRB ENDOTHELIN B ETRB Endothelin receptor non-selective type | Endothelin receptor, ET-A/ET-B
Type:
Enzyme Catalytic Domain
Mol. Mass.:
49664.00
Organism:
Homo sapiens (Human)
Description:
ENDOTHELIN B EDNRB HUMAN::P24530
Residue:
442
  
Inhibitor
Name:
BDBM50289942
Synonyms:
3-(4-Chloro-3-methyl-isoxazol-5-ylsulfamoyl)-thiophene-2-carboxylic acid | CHEMBL67664
Type:
Small organic molecule
Emp. Form.:
C9H7ClN2O5S2
Mol. Mass.:
322.745
SMILES:
Cc1noc(NS(=O)(=O)c2ccsc2C(O)=O)c1Cl
: