Target
D(3) dopamine receptor
Ligand
BDBM50290031
Substrate
Meas. Tech.
ChEBML_58779
Ki
660±n/a nM
Citation
 Haworth, KEHarrison, TKulagowski, JJLeeson, PDOwens, APRidgill, MPTeall, MRFielding, MChapman, KEmms, FMarwood, RPatel, SMoss, KL 4-Heterocyclyl tetrahydropyridines as selective ligands for the human dopamine D4 receptor Bioorg Med Chem Lett 7:2211-2216 (1997)    Article 
Target
Name:
D(3) dopamine receptor
Synonyms:
DOPAMINE D3 DRD3_HUMAN Dopamine D3 receptor (D3) Dopamine receptor Dopamine receptor D3
Type:
Mol. Mass.:
44243.43
Organism:
Homo sapiens (Human)
Description:
Residue:
400
  
Inhibitor
Name:
BDBM50290031
Synonyms:
5-Chloro-2-[1-(4-chloro-benzyl)-1,2,3,6-tetrahydro-pyridin-4-yl]-benzothiazole | CHEMBL70215
Type:
Small organic molecule
Emp. Form.:
C19H16Cl2N2S
Mol. Mass.:
375.315
SMILES:
Clc1ccc(CN2CCC(=CC2)c2nc3cc(Cl)ccc3s2)cc1
: