Target
D(4) dopamine receptor
Ligand
BDBM50290033
Substrate
Meas. Tech.
ChEBML_58934
Ki
87±n/a nM
Citation
 Haworth, KEHarrison, TKulagowski, JJLeeson, PDOwens, APRidgill, MPTeall, MRFielding, MChapman, KEmms, FMarwood, RPatel, SMoss, KL 4-Heterocyclyl tetrahydropyridines as selective ligands for the human dopamine D4 receptor Bioorg Med Chem Lett 7:2211-2216 (1997)    Article 
Target
Name:
D(4) dopamine receptor
Synonyms:
D(2C) dopamine receptor DOPAMINE D4.2 DRD4 Dopamine D4 receptor
Type:
Enzyme
Mol. Mass.:
48373.19
Organism:
Homo sapiens (Human)
Description:
P21917
Residue:
419
  
Inhibitor
Name:
BDBM50290033
Synonyms:
2-[1-(2-Chloro-benzyl)-1,2,3,6-tetrahydro-pyridin-4-yl]-benzothiazole | CHEMBL67982
Type:
Small organic molecule
Emp. Form.:
C19H17ClN2S
Mol. Mass.:
340.87
SMILES:
Clc1ccccc1CN1CCC(=CC1)c1nc2ccccc2s1
: