Target
D(2) dopamine receptor
Ligand
BDBM50290037
Substrate
Meas. Tech.
ChEBML_58462
Ki
670±n/a nM
Citation
 Haworth, KEHarrison, TKulagowski, JJLeeson, PDOwens, APRidgill, MPTeall, MRFielding, MChapman, KEmms, FMarwood, RPatel, SMoss, KL 4-Heterocyclyl tetrahydropyridines as selective ligands for the human dopamine D4 receptor Bioorg Med Chem Lett 7:2211-2216 (1997)    Article 
Target
Name:
D(2) dopamine receptor
Synonyms:
D(2) dopamine receptor DOPAMINE D2 Long DRD2 Dopamine D2 receptor Dopamine D2 receptor (D2R) Dopamine2-like | d2
Type:
Cell-surface receptors
Mol. Mass.:
50647.10
Organism:
Homo sapiens (Human)
Description:
P14416
Residue:
443
  
Inhibitor
Name:
BDBM50290037
Synonyms:
2-[1-(4-Chloro-benzyl)-1,2,3,6-tetrahydro-pyridin-4-yl]-1H-benzoimidazole | CHEMBL305481
Type:
Small organic molecule
Emp. Form.:
C19H18ClN3
Mol. Mass.:
323.819
SMILES:
Clc1ccc(CN2CCC(=CC2)c2nc3ccccc3[nH]2)cc1
: