Target
Gamma-aminobutyric acid receptor subunit alpha-5
Ligand
BDBM50290077
Substrate
Meas. Tech.
ChEMBL_69806 (CHEMBL677202)
IC50
2.7±n/a nM
Citation
 Olivier, ASevrin, MDurant, FGeorge, P A conformational study of ligands for omega modulatory sites of GABAa receptors by NOESY NMR spectroscopy and distance geometry Bioorg Med Chem Lett 7:2277-2282 (1997)    Article 
Target
Name:
Gamma-aminobutyric acid receptor subunit alpha-5
Synonyms:
GABA receptor alpha-5 subunit GABRA5 Gamma-aminobutyric acid receptor subunit alpha-5 (GABA(A)) | Gamma-aminobutyric acid receptor subunit alpha-5 (GABAA)
Type:
Enzyme
Mol. Mass.:
52160.59
Organism:
Homo sapiens (Human)
Description:
P31644
Residue:
462
  
Inhibitor
Name:
BDBM50290077
Synonyms:
CHEMBL73416 Saripidem
Type:
Small organic molecule
Emp. Form.:
C19H20ClN3O
Mol. Mass.:
341.835
SMILES:
CCCC(=O)N(C)Cc1c(nc2ccccn12)-c1ccc(Cl)cc1
: