Target
Cytochrome P450 2C8
Ligand
BDBM50041457
Substrate
Meas. Tech.
ChEMBL_494881 (CHEMBL949431)
IC50
2700±n/a nM
Citation
 O'Neill, PMPark, BKShone, AEMaggs, JLRoberts, PStocks, PABiagini, GABray, PGGibbons, PBerry, NWinstanley, PAMukhtar, ABonar-Law, RHindley, SBambal, RBDavis, CBBates, MHart, TKGresham, SLLawrence, RMBrigandi, RAGomez-delas-Heras, FMGargallo, DVWard, SA Candidate selection and preclinical evaluation of N-tert-butyl isoquine (GSK369796), an affordable and effective 4-aminoquinoline antimalarial for the 21st century. J Med Chem 52:1408-15 (2010)  
Target
Name:
Cytochrome P450 2C8
Synonyms:
CP2C8_HUMAN CYPIIC8 P450 IIC2 P450 form 1 | S-mephenytoin 4-hydroxylase
Type:
Protein
Mol. Mass.:
55839.23
Organism:
Homo sapiens (Human)
Description:
P10632
Residue:
490
  
Inhibitor
Name:
BDBM50041457
Synonyms:
4-[(7-chloroquinolin-4-yl)amino]-2-[(diethylamino)methyl]phenol CHEMBL682 | med.21724, Compound 188
Type:
Small organic molecule
Emp. Form.:
C20H22ClN3O
Mol. Mass.:
355.861
SMILES:
CCN(CC)Cc1cc(Nc2ccnc3cc(Cl)ccc23)ccc1O
: