Target
Galanin receptor type 1
Ligand
BDBM50293024
Substrate
Meas. Tech.
ChEMBL_518781 (CHEMBL960417)
Ki
0.500000±n/a nM
Citation
 Zhang, LRobertson, CRGreen, BRPruess, THWhite, HSBulaj, G Structural requirements for a lipoamino acid in modulating the anticonvulsant activities of systemically active galanin analogues. J Med Chem 52:1310-6 (2009)  
Target
Name:
Galanin receptor type 1
Synonyms:
GAL1-R GALNR1 GALR1_HUMAN Galanin receptor 1 | Galanin receptor type 1
Type:
Enzyme Catalytic Domain
Mol. Mass.:
38976.60
Organism:
Homo sapiens (Human)
Description:
Galanin R1 GALR1 HUMAN::P47211
Residue:
349
  
Inhibitor
Name:
BDBM50293024
Synonyms:
(Sar)WTLNSAGYLLGPKK(Lys-MPEG4)K | CHEMBL505299
Type:
Small organic molecule
Emp. Form.:
C99H163N23O28
Mol. Mass.:
2123.4908
SMILES:
CNCC(=O)O[C@@H](Cc1c[nH]c2ccccc12)C(=O)N[C@@H]([C@@H](C)O)C(=O)N[C@@H](CC(C)C)C(=O)N[C@@H](CC(N)=O)C(=O)N[C@@H](CO)C(=O)N[C@@H](C)C(=O)NCC(=O)N[C@@H](Cc1ccc(O)cc1)C(=O)N[C@@H](CC(C)C)C(=O)N[C@@H](CC(C)C)C(=O)NCC(=O)N1CCC[C@H]1C(=O)N[C@@H](CCCCN)C(=O)N[C@@H](CCCCN)C(=O)N[C@@H](CCCCNC(=O)COCCOCCOCCOCCOC)C(=O)N[C@@H](CCCCN)C(N)=O
: