Target
Sodium-dependent dopamine transporter
Ligand
BDBM50048392
Substrate
Meas. Tech.
ChEMBL_571435 (CHEMBL1032746)
Ki
441±n/a nM
Citation
 Lapinsky, DJAggarwal, SHuang, YSurratt, CKLever, JRFoster, JDVaughan, RA A novel photoaffinity ligand for the dopamine transporter based on pyrovalerone. Bioorg Med Chem 17:3770-4 (2009)  
Target
Name:
Sodium-dependent dopamine transporter
Synonyms:
DA transporter DAT1 Dopamine transporter protein (DAT) SC6A3_HUMAN Sodium-dependent dopamine transporter Solute carrier family 6 member 3
Type:
Multi-pass membrane protein
Mol. Mass.:
68497.11
Organism:
Homo sapiens (Human)
Description:
Q01959
Residue:
620
  
Inhibitor
Name:
BDBM50048392
Synonyms:
2-(tert-butylamino)-1-(3-chlorophenyl)propan-1-one BUPROPION HYDROCHLORIDE US9944618, Compound ID No. 176
Type:
Small organic molecule
Emp. Form.:
C13H18ClNO
Mol. Mass.:
239.741
SMILES:
CC(NC(C)(C)C)C(=O)c1cccc(Cl)c1
: