Target
Leukotriene A-4 hydrolase
Ligand
BDBM50294168
Substrate
Meas. Tech.
ChEMBL_571718 (CHEMBL1032963)
IC50
1491000±n/a nM
Citation
 Davies, DRMamat, BMagnusson, OTChristensen, JHaraldsson, MHMishra, RPease, BHansen, ESingh, JZembower, DKim, HKiselyov, ASBurgin, ABGurney, MEStewart, LJ Discovery of leukotriene A4 hydrolase inhibitors using metabolomics biased fragment crystallography. J Med Chem 52:4694-715 (2009)  
Target
Name:
Leukotriene A-4 hydrolase
Synonyms:
LKHA4_HUMAN LTA4 Leukotriene A(4) hydrolase Leukotriene A4 hydrolase
Type:
Hydrolase; metalloprotease
Mol. Mass.:
69280.41
Organism:
Homo sapiens (Human)
Description:
Human recombinant LTA4H.
Residue:
611
  
Inhibitor
Name:
BDBM50294168
Synonyms:
1-(2-(1H-indol-5-yloxy)ethyl)piperidine-4-carboxylic acid CHEMBL562164
Type:
Small organic molecule
Emp. Form.:
C16H20N2O3
Mol. Mass.:
288.3416
SMILES:
OC(=O)C1CCN(CCOc2ccc3[nH]ccc3c2)CC1
: