Target
Oxysterols receptor LXR-beta
Ligand
BDBM50294746
Substrate
Meas. Tech.
ChEMBL_576092 (CHEMBL1057733)
IC50
14000±n/a nM
Citation
 Hu, BUnwalla, RCollini, MQuinet, EFeingold, IGoos-Nilsson, AWihelmsson, ANambi, PWrobel, J Discovery and SAR of cinnolines/quinolines as liver X receptor (LXR) agonists with binding selectivity for LXRbeta. Bioorg Med Chem 17:3519-27 (2009)  
Target
Name:
Oxysterols receptor LXR-beta
Synonyms:
LXRB Liver X, LXR beta NR1H2 Nuclear receptor NER Ubiquitously-expressed nuclear receptor
Type:
Enzyme Catalytic Domain
Mol. Mass.:
50978.79
Organism:
Homo sapiens (Human)
Description:
P55055
Residue:
460
  
Inhibitor
Name:
BDBM50294746
Synonyms:
3-Benzyl-8-chloro-4-{3-[(2-chlorobenzyl)oxy]phenyl}-cinnoline | CHEMBL549418
Type:
Small organic molecule
Emp. Form.:
C28H20Cl2N2O
Mol. Mass.:
471.377
SMILES:
Clc1ccccc1COc1cccc(c1)-c1c(Cc2ccccc2)nnc2c(Cl)cccc12
: