Target
Oxysterols receptor LXR-beta
Ligand
BDBM50294749
Substrate
Meas. Tech.
ChEMBL_576092 (CHEMBL1057733)
IC50
85000±n/a nM
Citation
 Hu, BUnwalla, RCollini, MQuinet, EFeingold, IGoos-Nilsson, AWihelmsson, ANambi, PWrobel, J Discovery and SAR of cinnolines/quinolines as liver X receptor (LXR) agonists with binding selectivity for LXRbeta. Bioorg Med Chem 17:3519-27 (2009)  
Target
Name:
Oxysterols receptor LXR-beta
Synonyms:
LXRB Liver X, LXR beta NR1H2 Nuclear receptor NER Ubiquitously-expressed nuclear receptor
Type:
Enzyme Catalytic Domain
Mol. Mass.:
50978.79
Organism:
Homo sapiens (Human)
Description:
P55055
Residue:
460
  
Inhibitor
Name:
BDBM50294749
Synonyms:
3-Benzyl-8-chloro-4-(3-{[5-chloro-2-(trifluoromethyl)-benzyl]oxy}phenyl)cinnoline | CHEMBL560648
Type:
Small organic molecule
Emp. Form.:
C29H19Cl2F3N2O
Mol. Mass.:
539.375
SMILES:
FC(F)(F)c1ccc(Cl)cc1COc1cccc(c1)-c1c(Cc2ccccc2)nnc2c(Cl)cccc12
: