Target
Oxysterols receptor LXR-alpha
Ligand
BDBM50294735
Substrate
Meas. Tech.
ChEMBL_576266 (CHEMBL1027818)
IC50
62000±n/a nM
Citation
 Hu, BUnwalla, RCollini, MQuinet, EFeingold, IGoos-Nilsson, AWihelmsson, ANambi, PWrobel, J Discovery and SAR of cinnolines/quinolines as liver X receptor (LXR) agonists with binding selectivity for LXRbeta. Bioorg Med Chem 17:3519-27 (2009)  
Target
Name:
Oxysterols receptor LXR-alpha
Synonyms:
LXRA Liver X receptor alpha Liver X receptor alpha (NR1H3) NR1H3 Nuclear orphan receptor LXR-alpha | Nuclear receptor subfamily 1 group H member 3
Type:
Enzyme Catalytic Domain
Mol. Mass.:
50403.85
Organism:
Homo sapiens (Human)
Description:
Q13133
Residue:
447
  
Inhibitor
Name:
BDBM50294735
Synonyms:
CHEMBL558495 | [3-(8-Chloro-3-phenylcinnolin-4-yl)phenyl][(1-methyl-1H-indol-7-yl)methyl]amine
Type:
Small organic molecule
Emp. Form.:
C30H23ClN4
Mol. Mass.:
474.983
SMILES:
Cn1ccc2cccc(CNc3cccc(c3)-c3c(nnc4c(Cl)cccc34)-c3ccccc3)c12
: