Target
Oxysterols receptor LXR-alpha
Ligand
BDBM50294744
Substrate
Meas. Tech.
ChEMBL_576266 (CHEMBL1027818)
IC50
837000±n/a nM
Citation
 Hu, BUnwalla, RCollini, MQuinet, EFeingold, IGoos-Nilsson, AWihelmsson, ANambi, PWrobel, J Discovery and SAR of cinnolines/quinolines as liver X receptor (LXR) agonists with binding selectivity for LXRbeta. Bioorg Med Chem 17:3519-27 (2009)  
Target
Name:
Oxysterols receptor LXR-alpha
Synonyms:
LXRA Liver X receptor alpha Liver X receptor alpha (NR1H3) NR1H3 Nuclear orphan receptor LXR-alpha | Nuclear receptor subfamily 1 group H member 3
Type:
Enzyme Catalytic Domain
Mol. Mass.:
50403.85
Organism:
Homo sapiens (Human)
Description:
Q13133
Residue:
447
  
Inhibitor
Name:
BDBM50294744
Synonyms:
3-Benzyl-8-chloro-4-(3-{[2-chloro-3-(trifluoromethyl)-benzyl]oxy}phenyl)cinnoline | CHEMBL550983
Type:
Small organic molecule
Emp. Form.:
C29H19Cl2F3N2O
Mol. Mass.:
539.375
SMILES:
FC(F)(F)c1cccc(COc2cccc(c2)-c2c(Cc3ccccc3)nnc3c(Cl)cccc23)c1Cl
: