Target
Oxysterols receptor LXR-alpha
Ligand
BDBM50294754
Substrate
Meas. Tech.
ChEMBL_576266 (CHEMBL1027818)
IC50
>1000000±n/a nM
Citation
 Hu, BUnwalla, RCollini, MQuinet, EFeingold, IGoos-Nilsson, AWihelmsson, ANambi, PWrobel, J Discovery and SAR of cinnolines/quinolines as liver X receptor (LXR) agonists with binding selectivity for LXRbeta. Bioorg Med Chem 17:3519-27 (2009)  
Target
Name:
Oxysterols receptor LXR-alpha
Synonyms:
LXRA Liver X receptor alpha Liver X receptor alpha (NR1H3) NR1H3 Nuclear orphan receptor LXR-alpha | Nuclear receptor subfamily 1 group H member 3
Type:
Enzyme Catalytic Domain
Mol. Mass.:
50403.85
Organism:
Homo sapiens (Human)
Description:
Q13133
Residue:
447
  
Inhibitor
Name:
BDBM50294754
Synonyms:
3-Benzyl-4-(3-{[5-chloro-2-(trifluoromethyl)benzyl]oxy}-phenyl)-8-(trifluoromethyl)cinnoline | CHEMBL563706
Type:
Small organic molecule
Emp. Form.:
C30H19ClF6N2O
Mol. Mass.:
572.928
SMILES:
FC(F)(F)c1ccc(Cl)cc1COc1cccc(c1)-c1c(Cc2ccccc2)nnc2c(cccc12)C(F)(F)F
: