Target
D(2) dopamine receptor
Ligand
BDBM50273938
Substrate
Meas. Tech.
ChEMBL_576759 (CHEMBL1032026)
Ki
26±n/a nM
Citation
 Brown, DAMishra, MZhang, SBiswas, SParrington, IAntonio, TReith, MEDutta, AK Investigation of various N-heterocyclic substituted piperazine versions of 5/7-{[2-(4-aryl-piperazin-1-yl)-ethyl]-propyl-amino}-5,6,7,8-tetrahydro-naphthalen-2-ol: effect on affinity and selectivity for dopamine D3 receptor. Bioorg Med Chem 17:3923-33 (2009)  
Target
Name:
D(2) dopamine receptor
Synonyms:
DOPAMINE D2 DOPAMINE D2 Short Dopamine D2 receptor Drd2
Type:
G Protein-Coupled Receptor (GPCR)
Mol. Mass.:
50931.60
Organism:
Rattus norvegicus (rat)
Description:
P61169
Residue:
444
  
Inhibitor
Name:
BDBM50273938
Synonyms:
(-)-(S)-6-((2-(4-phenylpiperazin-1-yl)ethyl)(propyl)amino)-5,6,7,8-tetrahydronaphthalen-1-ol CHEMBL457024 | D-237
Type:
Small organic molecule
Emp. Form.:
C25H35N3O
Mol. Mass.:
393.5649
SMILES:
CCCN(CCN1CCN(CC1)c1ccccc1)[C@H]1CCc2c(O)cccc2C1
: