Target
Steroid 17-alpha-hydroxylase/17,20 lyase
Ligand
BDBM50295632
Substrate
Meas. Tech.
ChEMBL_577742 (CHEMBL1052377)
IC50
217±n/a nM
Citation
 Hille, UEHu, QVock, CNegri, MBartels, MMüller-Vieira, ULauterbach, THartmann, RW Novel CYP17 inhibitors: synthesis, biological evaluation, structure-activity relationships and modelling of methoxy- and hydroxy-substituted methyleneimidazolyl biphenyls. Eur J Med Chem 44:2765-75 (2009)  
Target
Name:
Steroid 17-alpha-hydroxylase/17,20 lyase
Synonyms:
CP17A_HUMAN CYP17A1 Cytochrome P450 17A1 Cytochrome P450 C17 (CYP17) Cytochrome P450-C17 P450-C17 Steroid 17-alpha-Monooxygenase (CYP17) Steroid 17-alpha-monooxygenase | cytochrome P450 monooxygenase 17 alpha hydroxylase/17,20-lyase (CYP17)
Type:
Enzyme
Mol. Mass.:
57382.42
Organism:
Homo sapiens (Human)
Description:
E.coli expressing human CYP17
Residue:
508
  
Inhibitor
Name:
BDBM50295632
Synonyms:
CHEMBL541941 | rac-3-Chloro-4'-(1-imidazol-1-yl-propyl)-biphenyl-4-ol
Type:
Small organic molecule
Emp. Form.:
C18H17ClN2O
Mol. Mass.:
312.793
SMILES:
CCC(c1ccc(cc1)-c1ccc(O)c(Cl)c1)n1ccnc1
: