Target
Histamine H1 receptor
Ligand
BDBM50295725
Substrate
Meas. Tech.
ChEMBL_577960 (CHEMBL1059633)
IC50
72±n/a nM
Citation
 Kubota, KKurebayashi, HMiyachi, HTobe, MOnishi, MIsobe, Y Synthesis and structure-activity relationships of phenothiazine carboxylic acids having pyrimidine-dione as novel histamine H(1) antagonists. Bioorg Med Chem Lett 19:2766-71 (2009)  
Target
Name:
Histamine H1 receptor
Synonyms:
H1R HISTAMINE H1 HRH1_HUMAN
Type:
G Protein-Coupled Receptor (GPCR)
Mol. Mass.:
55808.72
Organism:
Homo sapiens (Human)
Description:
Cell pellets from SK-N-MC cells transfected with human H1 receptor were used in binding assay.
Residue:
487
  
Inhibitor
Name:
BDBM50295725
Synonyms:
2-(10-(3-(4-(1,3-dimethyl-2,6-dioxo-1,2,3,6-tetrahydropyrimidin-4-yl)-1,4-diazepan-1-yl)propyl)-10H-phenothiazin-2-yl)propanoic acid | CHEMBL565083
Type:
Small organic molecule
Emp. Form.:
C29H35N5O4S
Mol. Mass.:
549.684
SMILES:
CC(C(O)=O)c1ccc2Sc3ccccc3N(CCCN3CCCN(CC3)c3cc(=O)n(C)c(=O)n3C)c2c1
: