Target
Hepatocyte growth factor receptor
Ligand
BDBM50295742
Substrate
Meas. Tech.
ChEMBL_577995 (CHEMBL1062250)
IC50
75±n/a nM
Citation
 Porter, JLumb, SFranklin, RJGascon-Simorte, JMCalmiano, MRiche, KLLallemand, BKeyaerts, JEdwards, HMaloney, ADelgado, JKing, LFoley, ALecomte, FReuberson, JMeier, CBatchelor, M Discovery of 4-azaindoles as novel inhibitors of c-Met kinase. Bioorg Med Chem Lett 19:2780-4 (2009)  
Target
Name:
Hepatocyte growth factor receptor
Synonyms:
Hepatocyte growth factor receptor Hepatocyte growth factor receptor (c-MET) MET Met proto-oncogene (hepatocyte growth factor receptor) Tyrosine-protein kinase Met (c-Met) c-Met kinase
Type:
Protein
Mol. Mass.:
155559.73
Organism:
Homo sapiens (Human)
Description:
P08581
Residue:
1390
  
Inhibitor
Name:
BDBM50295742
Synonyms:
3-(2-nitrophenylsulfonyl)-1H-pyrrolo[2,3-b]pyridine | CHEMBL552195
Type:
Small organic molecule
Emp. Form.:
C13H9N3O4S
Mol. Mass.:
303.293
SMILES:
[O-][N+](=O)c1ccccc1S(=O)(=O)c1c[nH]c2ncccc12
: