Target
Hepatocyte growth factor receptor
Ligand
BDBM50295750
Substrate
Meas. Tech.
ChEMBL_577995 (CHEMBL1062250)
IC50
15±n/a nM
Citation
 Porter, JLumb, SFranklin, RJGascon-Simorte, JMCalmiano, MRiche, KLLallemand, BKeyaerts, JEdwards, HMaloney, ADelgado, JKing, LFoley, ALecomte, FReuberson, JMeier, CBatchelor, M Discovery of 4-azaindoles as novel inhibitors of c-Met kinase. Bioorg Med Chem Lett 19:2780-4 (2009)  
Target
Name:
Hepatocyte growth factor receptor
Synonyms:
Hepatocyte growth factor receptor Hepatocyte growth factor receptor (c-MET) MET Met proto-oncogene (hepatocyte growth factor receptor) Tyrosine-protein kinase Met (c-Met) c-Met kinase
Type:
Protein
Mol. Mass.:
155559.73
Organism:
Homo sapiens (Human)
Description:
P08581
Residue:
1390
  
Inhibitor
Name:
BDBM50295750
Synonyms:
4-(6-(6-(4-methylpiperazin-1-yl)pyridin-3-yl)-1H-pyrrolo[3,2-b]pyridin-1-ylsulfonyl)benzo[c][1,2,5]oxadiazole | CHEMBL551458
Type:
Small organic molecule
Emp. Form.:
C23H21N7O3S
Mol. Mass.:
475.523
SMILES:
CN1CCN(CC1)c1ccc(cn1)-c1cnc2ccn(c2c1)S(=O)(=O)c1cccc2nonc12
: