Target
Hepatocyte growth factor receptor
Ligand
BDBM50295762
Substrate
Meas. Tech.
ChEMBL_577995 (CHEMBL1062250)
IC50
27.0±n/a nM
Citation
 Porter, JLumb, SFranklin, RJGascon-Simorte, JMCalmiano, MRiche, KLLallemand, BKeyaerts, JEdwards, HMaloney, ADelgado, JKing, LFoley, ALecomte, FReuberson, JMeier, CBatchelor, M Discovery of 4-azaindoles as novel inhibitors of c-Met kinase. Bioorg Med Chem Lett 19:2780-4 (2009)  
Target
Name:
Hepatocyte growth factor receptor
Synonyms:
Hepatocyte growth factor receptor Hepatocyte growth factor receptor (c-MET) MET Met proto-oncogene (hepatocyte growth factor receptor) Tyrosine-protein kinase Met (c-Met) c-Met kinase
Type:
Protein
Mol. Mass.:
155559.73
Organism:
Homo sapiens (Human)
Description:
P08581
Residue:
1390
  
Inhibitor
Name:
BDBM50295762
Synonyms:
CHEMBL550158 | tert-butyl 4-(1-(6-chloroimidazo[2,1-b]thiazol-5-ylsulfonyl)-1H-pyrrolo[3,2-b]pyridin-6-yl)piperazine-1-carboxylate
Type:
Small organic molecule
Emp. Form.:
C21H23ClN6O4S2
Mol. Mass.:
523.028
SMILES:
CC(C)(C)OC(=O)N1CCN(CC1)c1cnc2ccn(c2c1)S(=O)(=O)c1c(Cl)nc2sccn12
: