Target
Metabotropic glutamate receptor 1
Ligand
BDBM50296699
Substrate
Meas. Tech.
ChEMBL_582382 (CHEMBL1063419)
Ki
>40000±n/a nM
Citation
 Noeske, TTrifanova, DKauss, VRenner, SParsons, CGSchneider, GWeil, T Synergism of virtual screening and medicinal chemistry: identification and optimization of allosteric antagonists of metabotropic glutamate receptor 1. Bioorg Med Chem 17:5708-15 (2009)  
Target
Name:
Metabotropic glutamate receptor 1
Synonyms:
GRM1_RAT Grm1 Metabotropic glutamate receptor Mglur1 metabotropic glutamate 1/5-D metabotropic glutamate receptor 1 isoform alpha precursor
Type:
Enzyme Catalytic Domain
Mol. Mass.:
133240.47
Organism:
RAT
Description:
metabotropic glutamate 1/2 0 RAT::P23385
Residue:
1199
  
Inhibitor
Name:
BDBM50296699
Synonyms:
3-(4-(2,4-dichlorobenzyloxy)phenyl)-1-(4-ethoxyphenyl)prop-2-en-1-one | CHEMBL565004
Type:
Small organic molecule
Emp. Form.:
C24H20Cl2O3
Mol. Mass.:
427.32
SMILES:
CCOc1ccc(cc1)C(=O)\C=C\c1ccc(OCc2ccc(Cl)cc2Cl)cc1
: