Target
Metabotropic glutamate receptor 1
Ligand
BDBM50296690
Substrate
Meas. Tech.
ChEMBL_582382 (CHEMBL1063419)
Ki
>40000±n/a nM
Citation
 Noeske, TTrifanova, DKauss, VRenner, SParsons, CGSchneider, GWeil, T Synergism of virtual screening and medicinal chemistry: identification and optimization of allosteric antagonists of metabotropic glutamate receptor 1. Bioorg Med Chem 17:5708-15 (2009)  
Target
Name:
Metabotropic glutamate receptor 1
Synonyms:
GRM1_RAT Grm1 Metabotropic glutamate receptor Mglur1 metabotropic glutamate 1/5-D metabotropic glutamate receptor 1 isoform alpha precursor
Type:
Enzyme Catalytic Domain
Mol. Mass.:
133240.47
Organism:
RAT
Description:
metabotropic glutamate 1/2 0 RAT::P23385
Residue:
1199
  
Inhibitor
Name:
BDBM50296690
Synonyms:
7-(4-fluorobenzyloxy)-4-phenyl-2H-chromen-2-one | CHEMBL560273
Type:
Small organic molecule
Emp. Form.:
C22H15FO3
Mol. Mass.:
346.3511
SMILES:
Fc1ccc(COc2ccc3c(cc(=O)oc3c2)-c2ccccc2)cc1
: