Target
Metabotropic glutamate receptor 1
Ligand
BDBM50296691
Substrate
Meas. Tech.
ChEMBL_582382 (CHEMBL1063419)
Ki
>40000±n/a nM
Citation
 Noeske, TTrifanova, DKauss, VRenner, SParsons, CGSchneider, GWeil, T Synergism of virtual screening and medicinal chemistry: identification and optimization of allosteric antagonists of metabotropic glutamate receptor 1. Bioorg Med Chem 17:5708-15 (2009)  
Target
Name:
Metabotropic glutamate receptor 1
Synonyms:
GRM1_RAT Grm1 Metabotropic glutamate receptor Mglur1 metabotropic glutamate 1/5-D metabotropic glutamate receptor 1 isoform alpha precursor
Type:
Enzyme Catalytic Domain
Mol. Mass.:
133240.47
Organism:
RAT
Description:
metabotropic glutamate 1/2 0 RAT::P23385
Residue:
1199
  
Inhibitor
Name:
BDBM50296691
Synonyms:
3-(4-chlorophenyl)-1-(4-phenoxyphenyl)prop-2-en-1-one | CHEMBL558321
Type:
Small organic molecule
Emp. Form.:
C21H15ClO2
Mol. Mass.:
334.796
SMILES:
Clc1ccc(\C=C\C(=O)c2ccc(Oc3ccccc3)cc2)cc1
: