Target
Metabotropic glutamate receptor 5
Ligand
BDBM50296669
Substrate
Meas. Tech.
ChEMBL_582383 (CHEMBL1063420)
Ki
>100000±n/a nM
Citation
 Noeske, TTrifanova, DKauss, VRenner, SParsons, CGSchneider, GWeil, T Synergism of virtual screening and medicinal chemistry: identification and optimization of allosteric antagonists of metabotropic glutamate receptor 1. Bioorg Med Chem 17:5708-15 (2009)  
Target
Name:
Metabotropic glutamate receptor 5
Synonyms:
GRM5_RAT Grm5 Mglur5 metabotropic glutamate 5/1-C metabotropic glutamate 5a
Type:
Enzyme
Mol. Mass.:
131900.14
Organism:
Rattus norvegicus (Rat)
Description:
P31424
Residue:
1203
  
Inhibitor
Name:
BDBM50296669
Synonyms:
3-(2-chloro-7-methylquinolin-3-yl)-1-(thiophen-2-yl)prop-2-en-1-one | CHEMBL556293
Type:
Small organic molecule
Emp. Form.:
C17H12ClNOS
Mol. Mass.:
313.801
SMILES:
Cc1ccc2cc(\C=C\C(=O)c3cccs3)c(Cl)nc2c1
: