Target
Prostaglandin D2 receptor 2
Ligand
BDBM50161746
Substrate
Meas. Tech.
ChEMBL_582681 (CHEMBL1051055)
Ki
73±n/a nM
Citation
 Sandham, DAAdcock, CBala, KBarker, LBrown, ZDubois, GBudd, DCox, BFairhurst, RAFuregati, MLeblanc, CManini, JProfit, RReilly, JStringer, RSchmidt, ATurner, KLWatson, SJWillis, JWilliams, GWilson, C 7-Azaindole-3-acetic acid derivatives: potent and selective CRTh2 receptor antagonists. Bioorg Med Chem Lett 19:4794-8 (2009)  
Target
Name:
Prostaglandin D2 receptor 2
Synonyms:
CD_antigen=CD294 Chemoattractant Receptor-homologous molecule expressed on T-helper type 2 cells (CRTH2) Chemoattractant receptor-homologous molecule expressed on Th2 cells (CRTH2) G protein-coupled receptor 44 GPR44 PTGDR2 Prostaglandin D2 receptor 2 | Prostaglandin D2 receptor 2 (PGD2)
Type:
Enzyme
Mol. Mass.:
43295.45
Organism:
Homo sapiens (Human)
Description:
Q9Y5Y4
Residue:
395
  
Inhibitor
Name:
BDBM50161746
Synonyms:
(R)-3-(3-(4-fluorophenylsulfonamido)-1,2,3,4-tetrahydrocarbazol-9-yl)propanoic acid CHEMBL361812 | RAMATROBAN
Type:
Small organic molecule
Emp. Form.:
C21H21FN2O4S
Mol. Mass.:
416.466
SMILES:
OC(=O)CCn1c2CC[C@H](Cc2c2ccccc12)NS(=O)(=O)c1ccc(F)cc1
: