Target
Amine oxidase [flavin-containing] B
Ligand
BDBM50113851
Substrate
Meas. Tech.
ChEMBL_585481 (CHEMBL1059215)
IC50
20000±n/a nM
Citation
 Boppana, KDubey, PKJagarlapudi, SAVadivelan, SRambabu, G Knowledge based identification of MAO-B selective inhibitors using pharmacophore and structure based virtual screening models. Eur J Med Chem 44:3584-90 (2009)  
Target
Name:
Amine oxidase [flavin-containing] B
Synonyms:
AOFB_HUMAN MAOB Monoamine oxidase type B (MAO B) Monoamine oxidase type B (MAOB)
Type:
Protein
Mol. Mass.:
58768.76
Organism:
Homo sapiens (Human)
Description:
P27338
Residue:
520
  
Inhibitor
Name:
BDBM50113851
Synonyms:
(+/-)-Tranylcypromine 2-Phenyl-cyclopropylamine CHEMBL313833 Tranylcypromine,(+) US8609708, 6 Tranyl- cypromine | US8609708, 6 Tranylcypromine
Type:
Small organic molecule
Emp. Form.:
C9H11N
Mol. Mass.:
133.1903
SMILES:
NC1CC1c1ccccc1
: